{"text_format":"1","workbook":"xlsx","n_sheets":6,"sheets":["Page1","Page 2","Groups","Data","Codes","Building Data"],"not_rendered":{"charts":0,"images":0,"macros":1,"external_links":0,"defined_names":9,"comments":0,"pivot_tables":0},"unopened":[],"bounds":{"document_bytes":16777216,"sheet_cells":100000,"rows_first":2000,"rows_last":500,"rows_between":2000,"halvings":0,"cell_chars":16384,"cell_head_chars":4096},"cells_cut":0,"cells_raw":0,"read":"whole","date_system":"1900"}

{"sheet":"Page1","index":0,"n_rows":68,"n_cols":54,"rows_kept":68,"cut":false,"hidden":false,"merged":[[36,1,36,12],[41,44,41,48],[37,44,37,48],[44,52,52,58],[67,28,67,48],[38,44,38,48],[45,35,45,48],[65,30,66,43],[65,44,66,48],[61,7,61,20],[64,7,64,18],[64,19,64,21],[62,30,63,43],[62,44,63,48],[64,30,64,48],[46,9,46,25],[39,44,39,48],[40,44,40,48],[42,42,42,48],[14,8,14,11],[10,9,10,11],[9,3,9,8],[14,22,14,32],[14,16,14,20],[14,3,14,7],[14,33,14,42],[26,26,26,36],[26,38,26,48],[34,7,34,9],[28,38,28,48],[34,44,34,48],[34,22,34,24],[35,22,35,24],[34,13,34,20],[35,12,35,20],[25,1,25,12],[25,13,25,48],[26,1,26,12],[0,41,0,48],[1,45,1,48],[2,41,2,44],[6,1,6,48],[3,9,3,40],[3,1,3,8],[8,3,8,8],[11,3,11,12],[8,9,8,11],[10,3,10,8],[9,9,9,11],[0,9,0,40],[2,45,2,48],[1,41,1,44],[2,9,2,40],[1,9,1,40],[5,1,5,8],[1,1,1,8],[7,3,7,5],[7,9,7,11],[7,13,7,17],[11,18,11,19],[11,20,11,24],[11,25,11,48],[2,1,2,8],[62,24,62,27],[63,24,63,27],[47,35,47,48],[49,1,49,48],[50,1,50,48],[48,9,48,48],[47,9,47,25],[37,1,37,8],[63,7,63,18],[60,1,60,48],[45,9,45,25],[11,13,11,17],[14,13,14,15],[15,1,15,45],[24,1,24,12],[30,1,30,12],[35,1,35,5],[46,35,46,48],[5,9,5,11],[5,12,5,14],[5,15,5,19],[5,20,5,44],[35,7,35,9],[8,61,8,66],[8,67,8,69],[8,71,8,106],[17,13,22,48],[7,18,7,48],[30,13,31,48],[24,13,24,48],[31,1,31,12],[8,13,8,48],[9,13,9,48],[10,13,10,48],[26,13,26,21],[27,1,27,10],[28,13,28,23],[28,28,28,36],[29,13,29,23],[27,13,27,48],[12,20,12,48],[23,13,23,48],[29,28,29,36],[29,24,29,26],[29,38,29,48],[16,1,16,12],[23,1,23,12]]}
[null,null,null,null,null,null,null,null,null,"UNIVERSITY of VIRGINIA",null,null,null,null,null,null,null,null,null,null,null,null,null,null,null,null,null,null,null,null,null,null,null,null,null,null,null,null,null,null,null,{"$f":"IF(J2=\"APPLICATION FOR BUILDING PERMIT\",\"HECO-17a\",\"HECO-17\")","v":"HECO-17"}]
[null,null,null,null,null,null,null,null,null,"BUILDING PERMIT",null,null,null,null,null,null,null,null,null,null,null,null,null,null,null,null,null,null,null,null,null,null,null,null,null,null,null,null,null,null,null,"Issued:"]
[null,null,null,null,null,null,null,null,null,"FOR",null,null,null,null,null,null,null,null,null,null,null,null,null,null,null,null,null,null,null,null,null,null,null,null,null,null,null,null,null,null,null,"Expires:"]
[null,"(Revised 8/16/23)",null,null,null,null,null,null,null,"CONSTRUCTION ON STATE PROPERTY",null,null,null,null,null,null,null,null,null,null,null,null,null,null,null,null,null,null,null,null,null,null,null,null,null,null,null,null,null,null,null,null,null,null,null,null,null,null,"Page 1 of 2"]
[]
[null,"PROJECT:"]
[]
[null,null,null,"Bldg #",null,null,null,null,null,null,null,null,null,"Bldg Name:",null,null,null,null,{"$f":"VLOOKUP(J8,'Building Data'!A2:B764,2)","v":{"$error":"#N/A"}}]
[null,null,null,"Cap Project #:",null,null,null,null,null,null,null,null,null,"*** Enter the project location in the bldg, and general description of work "]
[null,null,null,"Sub-Project:"]
[null,null,null,"Agency:",null,null,null,null,null,null,null,null,null,{"$f":"IF(J11=207,\"University of Virginia\",IF(J11=209,\"University of Virginia Medical Center\",IF(J11=246,\"University of Virginia's College at Wise\",IF(J11=948,\"Southwest Virginia Higher Education Center\",\"*****   Please enter an Agency Code to the left  *****\"))))","v":"*****   Please enter an Agency Code to the left  *****"}]
[null,null,null,null,null,null,null,null,null,null,null,null,null,"FIPS Code:",null,null,null,null,{"$f":"VLOOKUP(J8,'Building Data'!A2:C764,3)","v":{"$error":"#N/A"}},null,"Location:",null,null,null,null,{"$f":"VLOOKUP(S12,'Building Data'!L2:N11,2)","v":{"$error":"#N/A"}}]
[null,null,null,null,null,null,null,null,null,null,null,null,null,"Street Address:",null,null,null,null,null,null,{"$f":"VLOOKUP(J8,'Building Data'!A2:D764,4)","v":{"$error":"#N/A"}}]
[]
[null,null,null,"PJ #:",null,null,null,null,null,null,null,null,null,"WO #:",null,null,null,null,null,null,null,null,"Indicate type of Project:"]
[]
[null,"BUILDING:"]
[null,"Work Permitted:",null,null,null,null,null,null,null,null,null,null,null,"*** Enter details of the scope (new construction, full renovation, major disciplines, etc)"]
[]
[]
[]
[]
[]
[null,"Purpose/Occupancy:",null,null,null,null,null,null,null,null,null,null,null,"*** Enter the purpose or need for the project, type of space (lab, office, etc)",null,null,null,null,null,null,null,null,null,null,null,null,null,null,null,null,null,null,null,null,null,null,null,null,null,null,null,null,null,null,null,null,null,null,null,null,null,null,null,"Fields are color coded:"]
[null,"Occupant Load:",null,null,null,null,null,null,null,null,null,null,null,"*** Enter the number of occupants in the area of construction",null,null,null,null,null,null,null,null,null,null,null,null,null,null,null,null,null,null,null,null,null,null,null,null,null,null,null,null,null,null,null,null,null,null,null,null,null,null,null,"User to enter"]
[null,"Occupancy Remarks:",null,null,null,null,null,null,null,null,null,null,null,"*** Enter the use group or type of use (offices being converted to labs, etc) if there is a change",null,null,null,null,null,null,null,null,null,null,null,null,null,null,null,null,null,null,null,null,null,null,null,null,null,null,null,null,null,null,null,null,null,null,null,null,null,null,null,"User to select from drop down menu"]
[null,"Building Code Edition:",null,null,null,null,null,null,null,null,null,null,null,"VUSBC 2018",null,null,null,null,null,null,null,null,null,null,null,null,"Accessibility Standards:",null,null,null,null,null,null,null,null,null,null,null,"2010 ADA Standards",null,null,null,null,null,null,null,null,null,null,null,null,null,null,"Auto filled or office use only"]
[null,"Type of Construction:",null,null,null,null,null,null,null,null,null,null,null,{"$f":"VLOOKUP(J8,'Building Data'!A2:F764,6)","v":{"$error":"#N/A"}}]
[null,"Use Group(s):",null,null,null,null,null,null,null,null,null,null,null,null,null,null,null,null,null,null,null,null,null,null,null,null,null,null,"Gross Area (gsf):"]
[null,"Building Height (feet):",null,null,null,null,null,null,null,null,null,null,null,null,null,null,null,null,null,null,null,null,null,null,null,null,null,null,"# of Stories:",null,null,null,null,null,null,null,null,null,{"$f":"VLOOKUP(J8,'Building Data'!A2:I764,9)","v":{"$error":"#N/A"}}]
[null,"Code Modifications Issued:"]
[null,"( Sections modified )"]
[]
[null,"Additional Submittals Required                                         "]
[null,"Fire Alarm",null,null,null,null,null,null,null,null,null,null,null,"Arc Flash Study",null,null,null,null,null,null,null,null,null,null,null,null,null,null,null,null,"Special Inspections Required ?"]
[null,"Sprinklers",null,null,null,null,null,null,null,null,null,null,"Delegated Structural"]
[null,null,null,null,null,null,null,null,null,null,null,null,null,null,null,null,null,null,null,null,null,null,null,null,null,null,null,null,null,null,"Key Dates"]
[null,"Fire Suppression",null,null,null,null,null,null,null,null,null,null,"Fire Alarm System",null,null,null,null,null,null,null,null,null,null,null,null,null,null,null,null,null,"E&S Stormwater Approval"]
[null,null,null,"Full",null,null,null,null,null,null,null,null,null,null,"Automatic",null,null,null,null,null,null,null,null,null,null,null,null,null,null,null,"AARB Approval Date:"]
[null,null,null,"Partial",null,null,null,null,null,null,null,null,null,null,"Manual",null,null,null,null,null,null,null,null,null,null,null,null,null,null,null,"Date of Plans & Specifications:"]
{"$rows_left_out":29}
{"sheet":"Page 2","index":1,"n_rows":68,"n_cols":29,"rows_kept":68,"cut":false,"hidden":false,"merged":[[37,2,40,10],[1,11,1,12],[2,11,2,12],[10,7,10,8],[0,4,0,8],[1,4,1,8],[2,5,2,9],[5,1,5,7],[6,1,6,7]]}
[]
[null,null,null,null,{"$f":"Page1!J1","v":"UNIVERSITY of VIRGINIA"},null,null,null,null,null,null,{"$f":"Page1!AP1","v":"HECO-17"}]
[{"$f":"Page1!D15","v":"PJ #:"},null,null,{"$f":"Page1!I15","v":0},null,null,null,null,null,null,null,"Page 2 of 2"]
[]
[]
[null,"Date of University Building Official Final Inspection"]
[null,"Date of Authorized Use & Occupancy"]
[null,"All work has been completed in accordance with the contract documents."]
[]
[]
[]
[null,null,null,"Project Manager",null,null,null,"Date"]
[]
[]
["Additional Building Official Comments:"]
[]
[]
[]
[]
[]
[]
[]
[]
[]
[]
[]
[]
[]
[]
[]
[]
[]
[]
[]
[]
[null,"REQUIRED INSPECTIONS",null,null,null,"(To be completed by OUBO)"]
[]
[null,null,"Inspection requests should be made at least 2 working days in advance.  Some inspections may be required at multiple stages of construction.  PM/CAM is responsible for making inspection requests at the appropriate stage of construction.  Refer to OUBO website for contact info, inspection checklists, and additional information."]
[]
[]
{"$rows_left_out":29}
{"sheet":"Groups","index":2,"n_rows":88,"n_cols":5,"rows_kept":88,"cut":false,"hidden":false,"merged":[]}
[]
[null,"\"GROUP\" REFERENCE LIST"]
[]
[null,"  Enter all applicable Groups ( the codes only ) in the Use Group field on \"Page 1\"."]
[]
[null,"  Refer to the Building Code for a more complete description and examples of these classifications."]
[]
[null,null,"Code","Description"]
[null,null,"A-1","Assembly uses, usually with fixed seating, intended for the production and viewing of"]
[null,null,null,null,"performing arts or motion pictures."]
[]
[null,null,"A-2","Assembly uses intended for food and/or drink consumption."]
[]
[null,null,"A-3","Assembly uses intended for worship, recreation or amusement and other assembly uses"]
[null,null,null,null,"not classified elsewhere in Group A."]
[]
[null,null,"A-4","Assembly uses intended for viewing of indoor sporting events and activities with"]
[null,null,null,null,"spectator seating."]
[]
[null,null,"A-5","Assembly uses intended for participation in or viewing outdoor activities."]
[]
[null,null,"B","Business Group B occupancy includes, among others, the use of a building or structure"]
[null,null,null,null,"or a portion thereof, for office, professional or service-type transactions,"]
[null,null,null,null,"including storage of records and accounts."]
[]
[null,null,"E","Educational Group E occupancy includes, among others, the use of a building or structure,"]
[null,null,null,null,"or a portion thereof, by six or more persons at any one time for educational"]
[null,null,null,null,"purposes through the 12th grade."]
[]
[null,null,"F-1","Factory industrial, moderate hazard."]
[]
[null,null,"F-2","Factory industrial, low hazard."]
[]
[null,null,"H-1","High hazard. Buildings and structures containing materials that pose a detonation hazard."]
[]
[null,null,"H-2","High hazard. Building and structures containing materials that present a deflagration "]
[null,null,null,null,"hazard or hazard from accelerated burning."]
[]
[null,null,"H-3","High hazard. Buildings and structures containing materials that readily support combustion"]
[null,null,null,null,"or present a physical hazard."]
{"$rows_left_out":49}
{"sheet":"Data","index":3,"n_rows":59,"n_cols":2,"rows_kept":59,"cut":false,"hidden":true,"merged":[]}
["BUILDING TYPE","STANDARD BUILDING"]
["FORM TYPE","PERMIT"]
[]
["PROJECT"]
["Agency Code",{"$f":"TEXT(Page1!J9,\"000\")","v":"000"}]
["Project Num",{"$f":"TEXT(Page1!J10,\"00000\")","v":"00000"}]
["Subproject Num",{"$f":"TEXT(Page1!J11,\"000\")","v":"000"}]
["Subproject Title",{"$f":"UPPER(Page1!N11)","v":"*****   PLEASE ENTER AN AGENCY CODE TO THE LEFT  *****"}]
["Architect/Engineer",{"$f":"UPPER(Page1!J46)","v":""}]
["Contractor",{"$f":"UPPER(Page1!J47)","v":""}]
["Contractor License Number",{"$f":"UPPER(Page1!J48)","v":""}]
[]
["BUILDING INFO"]
["Building Description",{"$f":"UPPER(Page1!J6)","v":""}]
["Building FIPS",{"$f":"LEFT(Page1!N12,3)","v":"FIP"}]
["Purpose-Occupancy",{"$f":"UPPER(Page1!N24)","v":"*** ENTER THE PURPOSE OR NEED FOR THE PROJECT, TYPE OF SPACE (LAB, OFFICE, ETC)"}]
["Occupancy Load",{"$f":"UPPER(Page1!N25)","v":"*** ENTER THE NUMBER OF OCCUPANTS IN THE AREA OF CONSTRUCTION"}]
["Occupancy Remarks",{"$f":"UPPER(Page1!N26)","v":"*** ENTER THE USE GROUP OR TYPE OF USE (OFFICES BEING CONVERTED TO LABS, ETC) IF THERE IS A CHANGE"}]
["Code Edition",{"$f":"UPPER(Page1!N27)","v":"VUSBC 2018"}]
["Use Group",{"$f":"UPPER(Page1!N28)","v":{"$error":"#N/A"}}]
["Construction Type",{"$f":"UPPER(Page1!#REF!)","v":{"$error":"#REF!"}}]
["Height",{"$f":"UPPER(Page1!N30)","v":""}]
["Number of Stories",{"$f":"UPPER(Page1!#REF!)","v":{"$error":"#REF!"}}]
["Gross Area",{"$f":"UPPER(Page1!#REF!)","v":{"$error":"#REF!"}}]
["Code Modifications",{"$f":"UPPER(Page1!N31)","v":""}]
["Floor Live Load",{"$f":"UPPER(Page1!N34)","v":""}]
["Roof Live Load",{"$f":"UPPER(Page1!N35)","v":"ARC FLASH STUDY"}]
["Soil Bearing Capacity",{"$f":"UPPER(Page1!#REF!)","v":{"$error":"#REF!"}}]
["Wind Speed",{"$f":"UPPER(Page1!M36)","v":"DELEGATED STRUCTURAL"}]
["Wind Exposure Category",{"$f":"UPPER(Page1!N37)","v":""}]
["Bldg Classification Category",{"$f":"UPPER(Page1!#REF!)","v":{"$error":"#REF!"}}]
["Seismic Exposure Group"]
["Seismic Performance Cat"]
["Seismic Design Category",{"$f":"UPPER(Page1!#REF!)","v":{"$error":"#REF!"}}]
["Fire Suppression - Wet",{"$f":"IF(Page1!B39=\"\",\"N\",\"X\")","v":"N"}]
["Fire Suppression - Dry",{"$f":"IF(Page1!B40=\"\",\"N\",\"X\")","v":"N"}]
["Fire Suppression - Chemical",{"$f":"IF(Page1!B41=\"\",\"N\",\"X\")","v":"N"}]
["Fire Suppression - Other",{"$f":"IF(Page1!B42=\"\",\"N\",\"X\")","v":"N"}]
["Fire Suppression - None",{"$f":"IF(Page1!B43=\"\",\"N\",\"X\")","v":"N"}]
["Fire Suppression - Not Reqd",{"$f":"IF(Page1!B44=\"\",\"N\",\"X\")","v":"N"}]
{"$rows_left_out":20}
{"sheet":"Codes","index":4,"n_rows":12,"n_cols":2,"rows_kept":12,"cut":false,"hidden":true,"merged":[]}
["FIPS","CONSTRUCTION_TYPE"]
["003 - Albemarle Co."]
["540 - Charlottesville, City Of","IA"]
["043 - Clarke Co.","IB"]
["131 - Northampton Co.","IIA"]
["195 - Wise Co.","IIB"]
["999 - Unknown Or Multiple Locations","IIIA"]
[null,"IIIB"]
[null,"IV"]
[null,"VA"]
[null,"VB"]
[null,"N/A"]

{"sheet":"Building Data","index":5,"n_rows":791,"n_cols":14,"rows_kept":791,"cut":false,"hidden":false,"merged":[]}
["FACILITYNUMBER","FACILITYNAME","FIPS","Street Address","Column Deleted","Constr Type Existing","Yr Blt-Applic Code-Constr Type","Sprinkler (% coverage)","# Stories","State Fire Marshal's Files in GES","Date purchased by UVA"]
[1,"Rotunda",3,"1826 University Ave ",null,"Maintain Type IIIB per VUSBC 2009","1828/post 1895/1973, Renov 2016-VUSBC 2009-Type IIIB","100% (w/ 2014 renovation)","4 or 5?","X",null,3,"Albemarle","Central"]
[2,"Hotel A",3,"161 McCormick Rd ",null,"Maintain Ordinary per VFSR","1825-VFSR-Ordinary",0,null,"X",null,15,"Augusta","Central"]
[6,"Hotel C/ Jefferson Hall",3,"185 McCormick Rd ",null,"Maintain Ordinary per VFSR",null,0,null,"X",null,31,"Campbell","Central"]
[10,"Hotel E/ Colonnade Hotel",3,"209 McCormick Rd ",null,"Maintain Ordinary per VFSR","1826/1846-VFSR-Ordinary",0,2,"X",null,43,"Clarke","Eastern"]
[11,"Hotel E Annex/ Colonnade Hotel",3,"211 McCormick Rd ",null,"Maintain Ordinary per VFSR","1826/1846-VFSR-Ordinary",0,null,null,null,71,"Giles","Western"]
[16,"Poe Alley #1",3,"179 McCormick Rd ",null,"(TBD - see OUBO)",null,0,null,null,null,131,"Northhampton","Eastern"]
[22,"Pavilion VII/Colonnade Club",3,"7 West Pav ",null,"Maintain Ordinary per VFSR","1821 Orig, 1913 Rear Addit-VFSR-Ordinary",1,null,"X",null,137,"Orange","Eastern"]
[44,"Hotel B/ Washington Hall",3,"12 Rotunda Dr ",null,"Maintain Ordinary per VFSR","1820 Orig,-VFSR-Ordinary",1,1,"X",null,195,"Wise","Western"]
[49,"Hospital Drive Traffic Pavilion",3,"50 Hospital Dr ",null,"(TBD - see OUBO)",null,null,null,null,null,540,"Charlottesville","Central"]
[52,"Hotel F/ Levering Hall",3,"50 Rotunda Dr ",null,"(TBD - see OUBO)",null,0,null,"X",null,610,"Falls Church","Eastern"]
[54,"Randall Hall",3,"130 Hospital Dr ",null,"Maintain Ordinary per VFSR","1900-VFSR-Ordinary",0,3]
[55,"Garrett Hall",3,"235 McCormick Rd ",null,"Maintain Type IIIB per VUSBC 2006","1908, Annex 1968, Renov 2011 - VUSBC 2006 - Type IIIB",1]
[56,"Varsity Hall",3,"136 Hospital Dr ",null,"Maintain Type IIIB per VUSBC 2000","Orig 1858 - VFSR-?, Renov 2007-VUSBC 2000-Type IIIB",1]
[57,"Robertson Hall",3,"125 Ruppel Dr ",null,"Maintain Type IB per VUSBC 2000","2008-VUSBC 2000-Type IB",1,null,"X"]
[58,"Rouss Hall",3,"40 South Lawn ",null,"(TBD - see OUBO)",null,1]
[59,"Old Cabell Hall",3,"30 South Lawn ",null,"Maintain Ordinary per VFSR","1896-VFSR-Ordinary","50% (audit, main lobby, attic, 2nd flr offices, language lab)",null,"X"]
[60,"New Cabell Hall",3,"1605 Jefferson Park Ave ",null,"Maintain Type IIA per VUSBC 2009","VFSR-Semi-Fireproof, 2010-VUSBC 2009-Type IIA",1,null,"X"]
[61,"Cocke Hall",3,"20 South Lawn ",null,"Maintain Type IIIB per VUSBC 2000","Orig-VFSR-?, Renov 2004-VUSBC 2000-Type IIIB",1]
[62,"Amphitheater",3,"93 Amphitheater Way ",null,"Maintain Ordinary per VFSR","1920-VFSR-Ordinary",0]
[63,"University Chapel",3,"145 McCormick Rd ",null,"Maintain Ordinary per VFSR","1953-VFSR-Ordinary",0]
[64,"Brooks Hall",3,"1702 University Ave ",null,"Maintain Ordinary per VFSR","1877-VFSR-Ordinary",0,3]
[65,"Minor Hall",3,"102 Amphitheater Way ",null,"Maintain Type IIIB per VUSBC 1987","1909-VFSR-Ordinary, Renov 1995-VUSBC 1987-Type IIIB",1,2,"X"]
[66,"Maury Hall",3,"128 Amphitheater Way ",null,"Maintain Noncombustible per VFSR","1942-VFSR-Noncombustible",1]
[67,"Halsey Hall",3,"148 Amphitheater Way ",null,"Maintain Ordinary per VFSR","1946-VFSR-Ordinary","1% (1 head in basement)"]
[68,"Clark Hall",3,"291 McCormick Rd ",null,"(orig constr or addit? - see OUBO)","1932-VFSR-Semi-Fireproof, 1949 addit VFSR, 2000 addit-VUSBC 1996 Type IIA (stairs in '49 addit rebuilt)",1,null,"X"]
[69,"Kerchof Hall",3,"141 Cabell Dr ",null,"Maintain Noncombustible per VFSR","1955-VFSR-Noncombustible",0,3,"X"]
[70,"South Lawn Commons",540,"1540 Jefferson Park Ave ",null,"(TBD - see OUBO)"]
[71,"South Lawn Nau Hall",540,"1540 Jefferson Park Ave ",null,"Maintain Type IIB per VUSBC 2003","2010-2003 VUSBC-Type IIB",1,4]
[72,"South Lawn Gibson Hall",540,"1540 Jefferson Park Ave ",null,"Maintain Type IIB per VUSBC 2003","2010-2003 VUSBC-Type IIB",1,4]
[82,"Alderman Library",3,"160 McCormick Rd ",null,"Maintain Semi-Fireproof per VFSR","1937-VFSR-Semi-Fireproof, 1967",0,null,"X"]
[83,"Monroe Hall",3,"248 McCormick Rd ",null,"(TBD - see OUBO)","1929-VFSR-Semi-Fireproof, Addit 1988-VUSBC 1981-Type IIB","15% (1988 addition basement only)"]
[89,"Dawson's Row #1",3,"1 Dawson's Row ",null,"Maintain Frame per VFSR","18__-VFSR-Frame",0]
[90,"Dawson's Row #2",3,"2 Dawson's Row ",null,"Maintain Frame per VFSR","1890-VFSR-Frame",0]
[91,"Dawson's Row #3",3,"3 Dawson's Row ",null,"Maintain Frame per VFSR","18__-VFSR-Frame",0]
[92,"Dawson's Row #4",3,"4 Dawson's Row ",null,"Maintain Frame per VFSR","1859-VFSR-Frame",0]
[93,"Monroe Hill Elevator",3,"65 Monroe Hill ",null,"(TBD - see OUBO)",1994,0]
[94,"Bryan Hall",3,"201 Cabell Dr ",null,"Maintain Type IIC per VUSBC 1987","1996-VUSBC 1987-Type IIC Noncombustible Unprotected",1]
[105,"McLeod Hall",540,"202 Jeannette Lancaster Way SW",null,"Maintain Semi-Fireproof per VFSR","1972-VFSR-Semi-fireproof","100% (w current renov)",null,"X"]
[106,"Claude Moore Nursing Education Building",540,"225 Jeannette Lancaster Way ",null,"(TBD - see OUBO)",null,1]
{"$rows_left_out":751}