{"text_format":"1","workbook":"xlsx","n_sheets":14,"sheets":["Warnings","Instructions","Assistance","General Project Info","Initialize","PART A","PART B","PART C","Print","PART B Instructions","PART C Instructions","Days","Code","ELEMENT SUMMARY"],"not_rendered":{"charts":0,"images":2,"macros":1,"external_links":0,"defined_names":31,"comments":0,"pivot_tables":0},"unopened":[],"bounds":{"document_bytes":16777216,"sheet_cells":100000,"rows_first":2000,"rows_last":500,"rows_between":2000,"halvings":0,"cell_chars":16384,"cell_head_chars":4096},"cells_cut":0,"cells_raw":0,"read":"whole","date_system":"1900"}

{"sheet":"Warnings","index":0,"n_rows":37,"n_cols":15,"rows_kept":37,"cut":false,"hidden":false,"merged":[[35,3,35,10]]}
[]
[null,"UNIVERSITY of VIRGINIA ",null,null,null,null,null,null,"HECO - 12 "]
[null,"(Revised 10/10)"]
[null,"SCHEDULE OF VALUES and CERTIFICATE FOR PAYMENT"]
[]
[null,null,"Before using this Excel form, please read the following:"]
[]
[null,null,null,"If you use Excel 2003, Macro Security must be set to \"Medium\" !"]
[]
[null,null,null,null,"Check the Excel macro security settings, by picking Tools, Macro, and Security from the"]
[null,null,null,null,"main Excel menu.  If macro security is set at \"High\" or \"Very High\", change it to \"Medium\""]
[null,null,null,null,"and then immediately close Excel.  When Excel is reopened, the new macro security"]
[null,null,null,null,"setting will take effect.  If you get a message to \"Enable\" or \"Disable\" macros, pick \"Enable\"."]
[]
[null,null,null,"If you use Excel 2007, you must save this as a \"Macro-Enabled Worksheet\"."]
[]
[null,null,null,"Users may …"]
[]
[null,null,null,null,"Users may add, edit, or delete data in the those cells which are highlighted in yellow.  (e.g.,",null,null,null,null,null,null,null,null,null," )"]
[null,null,null,null,"Users may insert rows by using the Insert New Row button only !"]
{"$rows_left_out":18}
{"sheet":"Instructions","index":1,"n_rows":38,"n_cols":7,"rows_kept":38,"cut":false,"hidden":false,"merged":[[27,6,30,9],[5,1,5,9],[16,6,16,9],[17,6,17,9],[7,2,7,6],[9,1,9,4],[9,6,10,9],[12,6,13,9]]}
[]
[null,"UNIVERSITY of VIRGINIA ",null,null,null,"HECO - 12 "]
[null,"(Revised 12/06/2010)"]
[null,"SCHEDULE OF VALUES and CERTIFICATE FOR PAYMENT"]
[]
[null,"MAIN MENU and GENERAL INSTRUCTIONS"]
[]
[null,null,"Before proceeding, please click here to read important warnings."]
[]
[null,"Complete each step below in the order listed.",null,null,null,null,"If you need assistance, click here."]
[null,"1."," Make a backup copy of this Excel file"]
[null,null," before proceeding to the next step."]
[null,null,null,null,null,null,"For questions regarding Retainage, refer to the notes included within Step 3."]
[null,"2."]
[]
[]
[null,"3.",null,null,null,null,"New users, please review the instructions"]
[null,null,null,null,null,null,"below before completing Parts B & C."]
[]
[null,"4."]
{"$rows_left_out":19}
{"sheet":"Assistance","index":2,"n_rows":26,"n_cols":8,"rows_kept":26,"cut":false,"hidden":false,"merged":[[26,2,45,7],[17,3,17,7],[18,3,18,7],[19,3,19,7],[21,3,21,7],[22,3,22,7],[23,3,23,7]]}
[{"$f":"Instructions!B3","v":"(Revised 12/06/2010)"}]
[]
[]
[null,"If you need assistance:"]
[]
[null,null,"For projects constructed under the provisions of the Higher Education Restructuring Act,"]
[null,null,"please direct ALL questions to that institution, otherwise:"]
[]
[null,null,"For content or procedural questions, such as contingency reductions, contact the Agency Project"]
[null,null,"Manager or their Architectural/Engineering Consultant, as appropriate."]
[]
[null,null,"For problems with the Excel spreadsheet, proper, please enter the information below and e-mail this"]
[null,null,"complete Excel file as an attachment to the following e-mail address:",null,null,null,null,"capout@dgs.virginia.gov"]
[]
[null,null,"( Please recall that it is not the responsibility of the DGS staff to help users correct worksheets which"]
[null,null,"  have been corrupted by user's failure to heed the warnings provided earlier. )"]
[]
[null,null,"Your Name:"]
[null,null,"   Phone Number:"]
[null,null,"   E-mail address:"]
{"$rows_left_out":7}
{"sheet":"General Project Info","index":3,"n_rows":29,"n_cols":5,"rows_kept":29,"cut":false,"hidden":false,"merged":[[1,2,1,5]]}
[]
[null,null,"STEP 2  -  Enter Project and Contract Information"]
[]
[null,"A )","Enter the following:"]
[]
[null,null,null,"Project Number:"]
[null,null,null,"Project Title:"]
[null,null,null,"Institution/Agency Name:"]
[null,null,null,"Location of Work:"]
[null,null,null,"A/E Firm Name:"]
[null,null,null,"Contractor Name:"]
[null,null,null,"Contractor FEIN:"]
[null,null,null,"( FEIN = Fed. Employer Identification Number )"]
[null,null,null,"UVA PO # "]
[null,null,null,"UVA PIMS Project #"]
[null,null,null,"UVA WO #"]
[null,null,null,"UVA PIMS Acct Code"]
[]
[null,null,null,"Date Contract Executed"]
[]
{"$rows_left_out":10}
{"sheet":"Initialize","index":4,"n_rows":70,"n_cols":11,"rows_kept":70,"cut":false,"hidden":false,"merged":[[1,2,1,8],[20,4,20,6],[24,4,28,8],[29,4,31,8]]}
[]
[null,null,"STEP 3  -  Prepare the HECO-12 for New Pay Period"]
[]
[]
[null,"WARNING:   Run the Initialize Macro only once before beginning each"]
[null,null,"new monthly pay request.  See the explanation below."]
[null,null,null,null,null,null,null,"Today is:",{"$f":"TODAY()","v":"2013-07-01"}]
[null,"A )",null,null,null,null,null,"NOTE:  This form was last initialized on:","2007-08-24"]
[]
[]
[null,"B )","Update the following data:"]
[]
[null,null,"    Pay Request Number:",null,1]
[]
[null,null,"         For Pay Period Beginning:"]
[]
[null,null,"         For Pay Period Ending:"]
[]
[null,null,"    Pay Request Submittal Date:"]
[]
{"$rows_left_out":51}
{"sheet":"PART A","index":5,"n_rows":70,"n_cols":10,"rows_kept":70,"cut":false,"hidden":false,"merged":[[41,6,41,9],[50,1,51,9],[8,1,13,1],[4,9,5,9],[4,7,5,8],[4,3,4,6],[5,3,6,6],[0,1,2,3],[7,3,7,6],[39,2,39,3],[37,2,37,3],[37,6,37,9]]}
[null,"STEP 6 - Review PART A",null,null,null,"NOTE:  All information on the PART A page is updated from entries made in the other steps."]
[null,null,null,null,"      Return to General Instructions","If any information on the PART A summary appears incorrect, return to the appropriate step"]
[null,null,null,null,null,"and make changes as required."]
[]
[null,"Univ. of Virginia    (Form HECO-12)",null,"SCHEDULE OF VALUES",null,null,null,"PAYMENT REQUEST NO. ",null,{"$f":"Initialize!E13","v":1}]
[null," (Rev. 12/06/2010)",null,"and"]
[null," PART A",null,null,null,null,null,null,"PERIOD BEGINNING DATE: ",{"$f":"Initialize!E15","v":"00:00:00"}]
[null," SUMMARY AND CERTIFICATION",null,"CERTIFICATE FOR PAYMENT",null,null,null,null,"PERIOD ENDING DATE: ",{"$f":"Initialize!E17","v":"00:00:00"}]
[]
[null,null,"PROJECT CODE:  ",{"$f":"'General Project Info'!F6","v":0},null,null,null,null,"UVA PO # ",{"$f":"IF('General Project Info'!$F$14=0,\"*** enter UVA PO# in step 2***\",'General Project Info'!$F$14)","v":"*** enter UVA PO# in step 2***"}]
[null,null,"  AGENCY NAME:  ",{"$f":"'General Project Info'!F8","v":0},null,null,null,null,"PIMS Project:",{"$f":"IF('General Project Info'!$F$15=0,\"*** enter UVA PIMS# in step 2***\",'General Project Info'!$F$15)","v":"*** enter UVA PIMS# in step 2***"}]
[null,null,"  PROJECT TITLE:  ",{"$f":"'General Project Info'!F7","v":0},null,null,null,null,"WO #:",{"$f":"IF('General Project Info'!$F$16=0,\"*** enter UVA WO# in step 2***\",'General Project Info'!$F$16)","v":"*** enter UVA WO# in step 2***"}]
[null,null,null,null,null,null,null,null,"PIMS Acct Code",{"$f":"IF('General Project Info'!$F$17=0,\"*** enter PIMS Acct Code in step 2***\",'General Project Info'!$F$17)","v":"*** enter PIMS Acct Code in step 2***"}]
[]
[null,null,null,null,null,null,"VALUE OF WORK COMPLETED"]
[null,null,null,null,null,null,"PREVIOUS","VALUE","CURRENT"]
[null,null,null,null,null,"TOTAL","VALUE","THIS","VALUE","PERCENT"]
[null,null,null,null,null,"VALUE","TO DATE","REPORT","TO DATE","COMPLETE"]
[null,null,null,null,null,"A","B","C","D = B + C","E = D / A"]
[null,"  Original Contract Line Items (from HECO-12, PART B)",null,null,null,{"$f":"'PART B'!$D$56","v":0},{"$f":"'PART B'!$E$56","v":0},{"$f":"'PART B'!$F$56","v":0},{"$f":"'PART B'!$G$56","v":0},{"$f":"IF(F20=0,0,+I20/F20)","v":0}]
{"$rows_left_out":51}
{"sheet":"PART B","index":6,"n_rows":56,"n_cols":13,"rows_kept":56,"cut":false,"hidden":false,"merged":[[0,7,3,12],[0,0,2,3],[9,1,10,2],[4,12,5,12],[4,3,4,7],[4,8,5,11]]}
["STEP 4 - Complete PART B"]
[]
[]
[]
[" University of Virginia   (Form HECO-12)",null,null,"SCHEDULE OF VALUES AND CERTIFICATE FOR PAYMENT",null,null,null,null,"PAYMENT REQUEST NO. ",null,null,null,{"$f":"Initialize!E13","v":1}]
[{"$f":"'PART A'!B6","v":" (Rev. 12/06/2010)"},null,null,"PROJECT CODE:",{"$f":"'General Project Info'!F6","v":0}]
[" PART B",null,null,"AGENCY NAME:",{"$f":"'General Project Info'!F8","v":0},null,null,null,null,null,null,"PERIOD BEGINNING DATE: ",{"$f":"Initialize!E15","v":"00:00:00"}]
[" ORIGINAL CONTRACT LINE ITEMS",null,null,"PROJECT TITLE:",{"$f":"'General Project Info'!F7","v":0},null,null,null,null,null,null,"PERIOD ENDING DATE: ",{"$f":"Initialize!E17","v":"00:00:00"}]
[]
[null,"DESCRIPTION",null,null,null,"VALUE OF WORK COMPLETED"]
[null,null,null,null,"PREVIOUS","VALUE","CURRENT",null,null,null,null,null,"DMBE"]
["ITEM","BUILDING","ADDITONAL","TOTAL","VALUE","THIS","VALUE","PERCENT","VENDOR",null,null,null,"CERTIFICATE"]
["NO.","ELEMENT","DESCRIPTION","VALUE","TO DATE","REPORT","TO DATE","COMPLETE","NAME","S","W","M","NUMBER"]
[]
[null,null,null,0,0,{"$f":"+G15-E15","v":0},{"$f":"ROUND(+D15*H15,2)","v":0},0,null,"N","N","N"]
[null,null,null,0,0,0,0,0,null,"N","N","N"]
[null,null,null,0,0,0,0,0,null,"N","N","N"]
[null,null,null,0,0,0,{"$f":"ROUND(+D18*H18,2)","v":0},0,null,"N","N","N"]
[null,null,null,0,0,0,0,0,null,"N","N","N"]
[null,null,null,0,0,0,{"$f":"ROUND(+D20*H20,2)","v":0},0,null,"N","N","N"]
{"$rows_left_out":37}
{"sheet":"PART C","index":7,"n_rows":54,"n_cols":12,"rows_kept":54,"cut":false,"hidden":false,"merged":[[4,11,5,11],[4,2,4,6],[4,7,5,10],[0,0,2,2],[0,6,3,11]]}
["STEP 5 - Complete PART C"]
[]
[]
[]
["University of Virginia   (Form HECO-12)",null,"SCHEDULE OF VALUES AND CERTIFICATE FOR PAYMENT",null,null,null,null,"PAYMENT REQUEST NO. ",null,null,null,{"$f":"Initialize!E13","v":1}]
[{"$f":"'PART A'!B6","v":" (Rev. 12/06/2010)"},null,"PROJECT CODE:",{"$f":"'General Project Info'!F6","v":0}]
[" PART C",null,"AGENCY NAME:",{"$f":"'General Project Info'!F8","v":0},null,null,null,null,null,null,"PERIOD BEGINNING DATE: ",{"$f":"Initialize!E15","v":"00:00:00"}]
[" CONSTRUCTION CHANGE ORDERS",null,"PROJECT TITLE:",{"$f":"'General Project Info'!F7","v":0},null,null,null,null,null,null,"PERIOD ENDING DATE: ",{"$f":"Initialize!E17","v":"00:00:00"}]
[]
[null,null,null,null,"VALUE OF WORK COMPLETED"]
["CHNG",null,null,"PREVIOUS","VALUE","CURRENT",null,null,null,null,null,"DMBE"]
["ORD.","ITEM","TOTAL","VALUE","THIS","VALUE","PERCENT","VENDOR",null,null,null,"CERTIFICATE"]
["NO.","DESCRIPTION","VALUE","TO DATE","REPORT","TO DATE","COMPLETE","NAME","S","W","M","NUMBER"]
[]
[null,null,0,0,{"$f":"+F15-D15","v":0},{"$f":"ROUND(+C15*G15,2)","v":0},0,null,"N","N","N"]
[null,null,0,0,{"$f":"+F16-D16","v":0},0,0,null,"N","N","N"]
[null,null,0,0,{"$f":"+F17-D17","v":0},0,0,null,"N","N","N"]
[null,null,0,0,{"$f":"+F18-D18","v":0},0,0,null,"N","N","N"]
[null,null,0,0,{"$f":"+F19-D19","v":0},0,0,null,"N","N","N"]
[null,null,0,0,0,0,0,null,"N","N","N"]
{"$rows_left_out":35}
{"sheet":"Print","index":8,"n_rows":2,"n_cols":2,"rows_kept":2,"cut":false,"hidden":false,"merged":[[1,1,3,3]]}
[]
[null,"STEP 7 - Print the HECO-12"]

{"sheet":"PART B Instructions","index":9,"n_rows":37,"n_cols":13,"rows_kept":37,"cut":false,"hidden":false,"merged":[[36,0,36,12],[34,0,34,8],[18,1,18,12],[28,4,28,12],[1,1,1,6],[30,0,30,12],[32,0,32,6],[24,0,24,12],[21,1,21,12],[11,1,12,2],[25,4,25,12],[22,3,22,12]]}
[]
[null,"PART B Instructions"]
[]
[null,"The ORIGINAL CONTRACT line items ( and progress for same ) are entered in PART B of the HECO-12 form."]
[null,"Below is an example PART B with detailed instructions shown in red."]
[null,"( Scroll down this page to view the step-by-step instructions. )"]
[]
[]
[]
[]
[]
[null,"DESCRIPTION",null,null,null,"VALUE OF WORK COMPLETED"]
[null,null,null,null,"PREVIOUS","VALUE","CURRENT",null,null,null,null,null,"DMBE"]
["ITEM","BUILDING","ADDITIONAL","TOTAL","VALUE","THIS","VALUE","PERCENT","VENDOR",null,null,null,"CERTIFICATE"]
["NO.","ELEMENT","DESCRIPTION","VALUE","TO DATE","REPORT","TO DATE","COMPLETE","NAME","S","W","M","NUMBER"]
[]
[null,null,null,0,0,{"$f":"+G17-E17","v":0},{"$f":"+D17*H17","v":0},0,null,"N","N","N"]
[1,null,null,0,0,{"$f":"+G18-E18","v":0},{"$f":"+D18*H18","v":0},0,null,"N","N","N"]
[null," Enter a unique number for each line item.  ( Examples:  1, 2, 3…..   1A, 1B, 1C……   100, 200, 300…..    100.1, 100.2, 100.3. )  No specific format is mandated for Item Number field."]
[1,"B1010  Floor Construction","2nd Floor",0,0,{"$f":"+G20-E20","v":0},{"$f":"+D20*H20","v":0},0,null,"N","N","N"]
{"$rows_left_out":18}
{"sheet":"PART C Instructions","index":10,"n_rows":36,"n_cols":12,"rows_kept":36,"cut":false,"hidden":false,"merged":[[35,0,35,11],[33,0,33,7],[23,1,23,11],[27,3,27,11],[1,1,1,5],[29,0,29,11],[24,2,24,11],[31,0,31,5],[18,1,18,11],[21,1,21,11]]}
[]
[null,"PART C Instructions"]
[]
[null,"The CONSTRUCTION CHANGE ORDERS ( and progress for same ) are entered in PART C of the HECO-12 form."]
[null,"Below is an example PART C with detailed instructions shown in red."]
[null,"( Scroll down this page to view the step-by-step instructions. )"]
[]
[]
[]
[]
[]
[null,null,null,null,"VALUE OF WORK COMPLETED"]
["CHNG",null,null,"PREVIOUS","VALUE","CURRENT",null,null,null,null,null,"DMBE"]
["ORD.","ITEM","TOTAL","VALUE","THIS","VALUE","PERCENT","VENDOR",null,null,null,"CERTIFICATE"]
["NO.","DESCRIPTION","VALUE","TO DATE","REPORT","TO DATE","COMPLETE","NAME","S","W","M","NUMBER"]
[]
[null,null,0,0,{"$f":"+F17-D17","v":0},{"$f":"+C17*G17","v":0},0,null,"N","N","N"]
[1,"ADDITIONAL LANDSCAPING",10000,0,{"$f":"+F18-D18","v":0},{"$f":"+C18*G18","v":0},0,null,"N","N","N"]
[null," Enter the Change Order Number.  ( Examples:  1, 2, 3…..).  Additional identifying numbers and/or letters may be added as shown in examples below as needed."]
["1a","ADDITIONAL LANDSCAPING - Additional trees and shrubs",6000,0,{"$f":"+F20-D20","v":0},{"$f":"+C20*G20","v":0},0,null,"N","N","N"]
{"$rows_left_out":17}
{"sheet":"Days","index":11,"n_rows":31,"n_cols":1,"rows_kept":31,"cut":false,"hidden":false,"merged":[]}
["first"]
["second"]
["third"]
["fourth"]
["fifth"]
["sixth"]
["seventh"]
["eighth"]
["ninth"]
["tenth"]
["eleventh"]
["twelfth"]
["thirteenth"]
["fourteenth"]
["fifthteenth"]
["sixteenth"]
["seventeenth"]
["eighteenth"]
["nineteenth"]
["twentieth"]
{"$rows_left_out":12}
{"sheet":"Code","index":12,"n_rows":95,"n_cols":4,"rows_kept":95,"cut":false,"hidden":false,"merged":[[3,1,5,3],[94,1,94,3]]}
[]
[null,"Use the Level III classification to describe Building Elements in the Schedule of Values."]
[]
[null,"Extracted, with permission, from ASTM E1557-09 Standard Classification for Building Elements and Related Sitework-UNIFORMAT II, copyright ASTM International, 100 Barr Harbor Drive, West Conshohocken, PA 19428.  A copy of the complete standard may be obtained from ASTM International, www.astm.org.\n\n \n"]
[]
[]
[null,"( Click here to visit astm.org )"]
[]
[null,"Level I","Level II","Level III"]
[null,null,null,"Code"]
[null,"A  Substructure","A10  Foundations","A1010  Standard Foundations"]
[null,null,null,"A1020  Special Foundations"]
[null,null,null,"A1030  Slab on Grade"]
[null,null,"A20  Basement Construction","A2010  Basement Excavation"]
[null,null,null,"A2020  Basement Walls"]
[null,"B  Shell","B10  Superstructure","B1010  Floor Construction"]
[null,null,null,"B1020  Roof Construction"]
[null,null,"B20  Exterior Enclosure","B2010  Exterior Walls"]
[null,null,null,"B2020  Exterior Windows"]
[null,null,null,"B2030  Exterior Doors"]
{"$rows_left_out":76}
{"sheet":"ELEMENT SUMMARY","index":13,"n_rows":141,"n_cols":88,"rows_kept":141,"cut":false,"hidden":false,"merged":[[5,3,5,4],[6,3,6,4],[7,3,7,4],[1,7,3,7],[3,1,3,5]]}
[]
[null,null,null,null,null,null,null,"DSUM FORMULAS FOR DATA COLLECTION FROM PART B","ELEMENT","ELEMENT","ELEMENT","ELEMENT","ELEMENT","ELEMENT","ELEMENT","ELEMENT","ELEMENT","ELEMENT","ELEMENT","ELEMENT","ELEMENT","ELEMENT","ELEMENT","ELEMENT","ELEMENT","ELEMENT","ELEMENT","ELEMENT","ELEMENT","ELEMENT","ELEMENT","ELEMENT","ELEMENT","ELEMENT","ELEMENT","ELEMENT","ELEMENT","ELEMENT","ELEMENT","ELEMENT","ELEMENT","ELEMENT","ELEMENT","ELEMENT","ELEMENT","ELEMENT","ELEMENT","ELEMENT","ELEMENT","ELEMENT","ELEMENT","ELEMENT","ELEMENT","ELEMENT","ELEMENT","ELEMENT","ELEMENT","ELEMENT","ELEMENT","ELEMENT","ELEMENT","ELEMENT","ELEMENT","ELEMENT","ELEMENT","ELEMENT","ELEMENT","ELEMENT","ELEMENT","ELEMENT","ELEMENT","ELEMENT","ELEMENT","ELEMENT","ELEMENT","ELEMENT","ELEMENT","ELEMENT","ELEMENT","ELEMENT","ELEMENT","ELEMENT","ELEMENT","ELEMENT","ELEMENT","ELEMENT","ELEMENT","ELEMENT"]
[null,null,null,null,null,null,null,null,"A1010  Standard Foundations",{"$f":"\"A1020  Special Foundations\"","v":"A1020  Special Foundations"},"A1030  Slab on Grade","A2010  Basement Excavation","A2020  Basement Walls","B1010  Floor Construction","B1020  Roof Construction","B2010  Exterior Walls","B2020  Exterior Windows","B2030  Exterior Doors","B3010  Roof Coverings","B3020  Roof Openings","C1010  Partitions","C1020  Interior Doors","C1030  Fittings","C2010  Stair Construction","C2020  Stair Finishes","C3010  Wall Finishes","C3020  Floor Finishes","C3030  Ceiling Finishes","D1010  Elevators & Lifts","D1020  Escalators & Moving Walks","D1090  Other Conveying Systems","D2010  Plumbing Fixtures","D2020  Domestic Water Distribution","D2030  Sanitary Waste","D2040  Rain Water Drainage","D2090  Other Plumbing Systems","D3010  Energy Supply","D3020  Heat Generating Systems","D3030  Cooling Generating Systems","D3040  Distribution Systems","D3050  Terminal & Package Units","D3060  Controls & Instrumentation","D3070  System Testing & Balancing","D3090  Other HVAC Systems & Equipment","D4010  Sprinklers","D4020  Standpipes","D4030  Fire Protection Specialties","D4090  Other Fire Protection Systems","D5010  Electrical Service & Distribution","D5020  Lighting and Branch Wiring","D5030  Communications & Security","D5090  Other Electrical Systems","E1010  Commercial Equipment","E1020  Institutional Equipment","E1030  Vehicular Equipment","E1090  Other Equipment","E2010  Fixed Furnishings","E2020  Movable Furnishings","F1010  Special Structures","F1020  Integrated Construction","F1030  Special Construction Systems","F1040  Special Facilities","F1050  Special Controls and Instrumentation","F2010  Building Elements Demolition","F2020  Hazardous Components Abatement","G1010  Site Clearing","G1020  Site Demolition and Relocations","G1030  Site Earthwork","G1040  Hazardous Waste Removal","G2010  Roadways","G2020  Parking Lots","G2030  Pedestrian Paving","G2040  Site Development","G2050  Landscaping","G3010  Water Supply","G3020  Sanitary Sewer","G3030  Storm Sewer","G3040  Heating Distribution","G3050  Cooling Distribution","G3060  Fuel Distribution","G3090  Other Site Mechanical Utilities","G4010  Electrical Distribution","G4020  Site Lighting","G4030  Site Communications & Security","G4090  Other Site Electrical Utilities","G9010  Services and Pedestrian Tunnels","G9090  Other Site Systems & Equipment","Z0000  General Conditions / Gen'l Requirements, OH & P"]
[null,"Original CO-12 Contract Values, summarized by Building Element",null,null,null,null,null,null,{"$f":"DSUM(ELEMENT_DATA,\"VALUE\",I2:I3)","v":0},0,0,0,0,0,0,0,0,0,0,0,0,0,0,0,0,0,0,0,0,0,0,0,0,0,0,0,0,0,0,0,{"$f":"DSUM(ELEMENT_DATA,\"VALUE\",AO2:AO3)","v":0},0,0,0,0,0,0,0,0,0,0,0,0,0,0,0,0,0,0,0,0,0,0,0,0,0,0,0,0,0,0,0,{"$f":"DSUM(ELEMENT_DATA,\"VALUE\",BU2:BU3)","v":0},0,0,0,0,0,0,0,0,0,0,0,0,0,0,0]
[]
[null,null,"PROJECT CODE: ",{"$f":"'General Project Info'!F6","v":0}]
[null,null,"AGENCY NAME: ",{"$f":"'General Project Info'!F8","v":0}]
[null,null,"PROJECT TITLE: ",{"$f":"'General Project Info'!F7","v":0}]
[]
[]
[null,null,null,"LEVEL I SUMMARY "]
[]
[null,null,"CODE","DESCRIPTION","AMOUNT"]
[]
[null,null,"A","Substructure",{"$f":"SUM(E30:E31)","v":0}]
[null,null,"B","Shell",{"$f":"SUM(E32:E34)","v":0}]
[null,null,"C","Interiors",{"$f":"SUM(E35:E37)","v":0}]
[null,null,"D","Services",{"$f":"SUM(E38:E42)","v":0}]
[null,null,"E","Equipment & Furnishings",{"$f":"SUM(E43:E44)","v":0}]
[null,null,"F","Special Construction & Demolition",{"$f":"SUM(E45:E46)","v":0}]
{"$rows_left_out":121}